{"text_format":"1","workbook":"xlsx","n_sheets":5,"sheets":["configuration","modified hex slots (V2)","modified hex slots","original hex slots","original dec slots"],"not_rendered":{"charts":2,"images":0,"macros":0,"external_links":0,"defined_names":0,"comments":0,"pivot_tables":0},"unopened":[],"bounds":{"document_bytes":16777216,"sheet_cells":100000,"rows_first":2000,"rows_last":500,"rows_between":2000,"halvings":0,"cell_chars":16384,"cell_head_chars":4096},"cells_cut":0,"cells_raw":0,"read":"whole","date_system":"1900"}

{"sheet":"configuration","index":0,"n_rows":62,"n_cols":7,"rows_kept":62,"cut":false,"hidden":false,"merged":[]}
[]
["DDT4all RS slots configurator"]
[]
["Set basic parameters",null,null,"Only edit fields with these colors:"]
["Max power",325,"hp"]
["Max torque",420,"Nm"]
["Max turbo pressure",1600,"mbar"]
["Max rpm",6800]
[]
[]
["Enable / Disable individual RS monitor screens"]
["Wheelspin","ON"]
["EDC present","ON"]
["Oscilloscope","ON"]
["GPS Stopwatch","OFF"]
["R.S. Maintenance","OFF",null,null,null,null,"Triggerhappy @ ClioClub.info 2020"]
["Advice","OFF"]
["Throttle mapping","ON"]
["Power steering","ON"]
["Shift beep threshold","ON"]
{"$rows_left_out":43}
{"sheet":"modified hex slots (V2)","index":1,"n_rows":45,"n_cols":21,"rows_kept":45,"cut":false,"hidden":true,"merged":[]}
[]
[null,null,null,null,null,null,null,"MODIFIED HEX SLOTS MEGANE RS TROPHY STAGE 1"]
[]
[null,null,null,null,null,null,null,null,"Slot 1"]
[null,"00","01","02","03","04","05","06","07","08","09","0A","0B","0C","0D","0E","0F",null,null,null,"Non RS models monitor activation (only by EEPROM reprogram)"]
["00000B10","0B","02","00","02","00","01","00","0A",{"$f":"LEFT(RIGHT(\"0\"&DEC2HEX(configuration!B6*10),4),2)","v":"10"},{"$f":"RIGHT(RIGHT(\"0\"&DEC2HEX(configuration!B6*10),4),2)","v":"68"},"01","08","00","05",{"$f":"LEFT(RIGHT(\"0\"&DEC2HEX(configuration!B5*10),4),2)","v":"0C"},{"$f":"RIGHT(RIGHT(\"0\"&DEC2HEX(configuration!B5*10),4),2)","v":"B2"},null,null,null,"new engine max power"]
["00000B20","01","0B","2E","E0","2E","E0",{"$f":"DEC2HEX(CEILING((configuration!B7+1185)/25.6,1))","v":"6D"},90,"01","07","5A","5A","BE","01","0A","3C",null,null,null,"new engine max torque"]
["00000B30","3C","78","01","04","2E","E0","2E","E0","32","C8","01","04","2E","E0","2E","E0",null,null,null,"new max turbo pressure"]
["00000B40","34","58","01","07","6E","6E","A0","01","05","00","00","19","0A","0A","27","10"]
["00000B50","27","10","36","B0","01","0A","5F","5F","91","01","0A","64","64","6E","01","00"]
["00000B60","00","00","0A","01","00","00","00","8C","01","07","2E","E0","32","C8","84","D0"]
["00000B70","01","0B","00","01","02","03","04","05","06","07","02","04","00","09",{"$f":"IF(configuration!B12=\"ON\",\"01\",\"00\")","v":"01"},{"$f":"IF(configuration!B13=\"ON\",\"01\",\"00\")","v":"01"},null,null,null,"new monitor screen configuration"]
["00000B80",{"$f":"IF(configuration!B14=\"ON\",\"01\",\"00\")","v":"01"},{"$f":"IF(configuration!B15=\"ON\",\"01\",\"00\")","v":"00"},{"$f":"IF(configuration!B16=\"ON\",\"01\",\"00\")","v":"00"},{"$f":"IF(configuration!B17=\"ON\",\"01\",\"00\")","v":"00"},{"$f":"IF(configuration!B18=\"ON\",\"01\",\"00\")","v":"01"},{"$f":"IF(configuration!B19=\"ON\",\"01\",\"00\")","v":"01"},{"$f":"IF(configuration!B20=\"ON\",\"01\",\"00\")","v":"01"},"80","80","80","80","75","75","75","72","6B",null,null,null,"Unknown graphs"]
["00000B90","6A","68","65","61","60","5E","61","5A","58","54","61","54","51","4B","61","4F"]
["00000BA0","4B","44","61","4B","46","3E","61","4A","44","3E","61","4B","44","3E","61","4D"]
["00000BB0","44","3E","61","4D","44","3E","61","80","80","80","80","83","83","83","83","85"]
["00000BC0","85","84","81","88","87","87","7F","8C","8B","89","7F","90","8F","8C","7F","97"]
["00000BD0","95","8F","7F","9E","9B","8F","7F","A8","A2","8F","7F","B3","A2","8F","7F","BA"]
["00000BE0","A2","8F","7F","BA","A2","8F","7F","14","50","6E","01","32","01","28","05","96"]
["00000BF0","23","00","00","00","00","00","00","00","00","00","00","00","00","00","00","00"]
{"$rows_left_out":26}
{"sheet":"modified hex slots","index":2,"n_rows":46,"n_cols":19,"rows_kept":46,"cut":false,"hidden":true,"merged":[]}
[]
[null,null,null,null,null,null,null,"MODIFIED HEX SLOTS MEGANE RS TROPHY STAGE 1"]
[]
[null,null,null,null,null,null,null,null,"Slot 1"]
[null,"00","01","02","03","04","05","06","07","08","09","0A","0B","0C","0D","0E","0F"]
["00000B10","00","02","00","01","00","0A",{"$f":"LEFT(RIGHT(\"0\"&DEC2HEX(configuration!B6*10),4),2)","v":"10"},{"$f":"RIGHT(RIGHT(\"0\"&DEC2HEX(configuration!B6*10),4),2)","v":"68"},"01","08","00","05",{"$f":"LEFT(RIGHT(\"0\"&DEC2HEX(configuration!B5*10),4),2)","v":"0C"},{"$f":"RIGHT(RIGHT(\"0\"&DEC2HEX(configuration!B5*10),4),2)","v":"B2"},"01","0B",null,"new engine max power"]
["00000B20","2E","E0","2E","E0",{"$f":"DEC2HEX(CEILING((configuration!B7+1185)/25.6,1))","v":"6D"},90,"01","07","5A","5A","BE","01","0A","3C","3C","78",null,"new engine max torque"]
["00000B30","01","04","2E","E0","2E","E0","32","C8","01","04","2E","E0","2E","E0","34","58",null,"new max turbo pressure"]
["00000B40","01","07","6E","6E","A0","01","05","00","00","19","0A","0A","27","10","27","10"]
["00000B50","36","B0","01","0A","5F","5F","91","01","0A","64","64","6E","01","00","00","00"]
["00000B60","0A","01","00","00","00","8C","01","07","2E","E0","32","C8","84","D0","01","0B"]
["00000B70","00","01","02","03","04","05","06","07","02","04","00","09",{"$f":"IF(configuration!B12=\"ON\",\"01\",\"00\")","v":"01"},{"$f":"IF(configuration!B13=\"ON\",\"01\",\"00\")","v":"01"},{"$f":"IF(configuration!B14=\"ON\",\"01\",\"00\")","v":"01"},{"$f":"IF(configuration!B15=\"ON\",\"01\",\"00\")","v":"00"},null,"new monitor screen configuration"]
["00000B80",{"$f":"IF(configuration!B16=\"ON\",\"01\",\"00\")","v":"00"},{"$f":"IF(configuration!B17=\"ON\",\"01\",\"00\")","v":"00"},{"$f":"IF(configuration!B18=\"ON\",\"01\",\"00\")","v":"01"},{"$f":"IF(configuration!B19=\"ON\",\"01\",\"00\")","v":"01"},{"$f":"IF(configuration!B20=\"ON\",\"01\",\"00\")","v":"01"},"80","80","80","80","75","75","75","72","6B","6A","68",null,"Unknown graphs"]
["00000B90","65","61","60","5E","61","5A","58","54","61","54","51","4B","61","4F","4B","44"]
["00000BA0","61","4B","46","3E","61","4A","44","3E","61","4B","44","3E","61","4D","44","3E"]
["00000BB0","61","4D","44","3E","61","80","80","80","80","83","83","83","83","85","85","84"]
["00000BC0","81","88","87","87","7F","8C","8B","89","7F","90","8F","8C","7F","97","95","8F"]
["00000BD0","7F","9E","9B","8F","7F","A8","A2","8F","7F","B3","A2","8F","7F","BA","A2","8F"]
["00000BE0","7F","BA","A2","8F","7F","14","50","6E","01","32","01","28","05","96","23","00"]
["00000BF0","00","00","00","00","00","00","00","00","00","00","00","00","00","00","00","00"]
{"$rows_left_out":27}
{"sheet":"original hex slots","index":3,"n_rows":41,"n_cols":17,"rows_kept":41,"cut":false,"hidden":true,"merged":[]}
[]
[]
[]
[]
[]
[null,null,null,null,null,null,null,null,"Slot 1"]
[null,"00","01","02","03","04","05","06","07","08","09","0A","0B","0C","0D","0E","0F"]
["00000B10","00","02","00","01","00","0A","0E","10","01","08","00","05","0A","BE","01","0B"]
["00000B20","2E","E0","2E","E0","65","90","01","07","5A","5A","BE","01","0A","3C","3C","78"]
["00000B30","01","04","2E","E0","2E","E0","32","C8","01","04","2E","E0","2E","E0","34","58"]
["00000B40","01","07","6E","6E","A0","01","05","00","00","19","0A","0A","27","10","27","10"]
["00000B50","36","B0","01","0A","5F","5F","91","01","0A","64","64","6E","01","00","00","00"]
["00000B60","0A","01","00","00","00","8C","01","07","2E","E0","32","C8","84","D0","01","0B"]
["00000B70","00","01","02","03","04","05","06","07","02","04","00","09","01","00","01","01"]
["00000B80","01","01","01","00","01","80","80","80","80","75","75","75","72","6B","6A","68"]
["00000B90","65","61","60","5E","61","5A","58","54","61","54","51","4B","61","4F","4B","44"]
["00000BA0","61","4B","46","3E","61","4A","44","3E","61","4B","44","3E","61","4D","44","3E"]
["00000BB0","61","4D","44","3E","61","80","80","80","80","83","83","83","83","85","85","84"]
["00000BC0","81","88","87","87","7F","8C","8B","89","7F","90","8F","8C","7F","97","95","8F"]
["00000BD0","7F","9E","9B","8F","7F","A8","A2","8F","7F","B3","A2","8F","7F","BA","A2","8F"]
{"$rows_left_out":22}
{"sheet":"original dec slots","index":4,"n_rows":42,"n_cols":17,"rows_kept":42,"cut":false,"hidden":true,"merged":[]}
[]
[]
[null,null,null,null,null,null,null,null,"Slot 1"]
[null,"00","01","02","03","04","05","06","07","08","09","0A","0A","0C","0D","0E","0F"]
["00000B10",{"$f":"HEX2DEC('original hex slots'!B8)","v":0},{"$f":"HEX2DEC('original hex slots'!C8)","v":2},{"$f":"HEX2DEC('original hex slots'!D8)","v":0},{"$f":"HEX2DEC('original hex slots'!E8)","v":1},{"$f":"HEX2DEC('original hex slots'!F8)","v":0},{"$f":"HEX2DEC('original hex slots'!G8)","v":10},{"$f":"HEX2DEC('original hex slots'!H8)","v":14},{"$f":"HEX2DEC('original hex slots'!I8)","v":16},{"$f":"HEX2DEC('original hex slots'!J8)","v":1},{"$f":"HEX2DEC('original hex slots'!K8)","v":8},{"$f":"HEX2DEC('original hex slots'!L8)","v":0},{"$f":"HEX2DEC('original hex slots'!M8)","v":5},{"$f":"HEX2DEC('original hex slots'!N8)","v":10},{"$f":"HEX2DEC('original hex slots'!O8)","v":190},{"$f":"HEX2DEC('original hex slots'!P8)","v":1},{"$f":"HEX2DEC('original hex slots'!Q8)","v":11}]
["00000B20",{"$f":"HEX2DEC('original hex slots'!B9)","v":46},{"$f":"HEX2DEC('original hex slots'!C9)","v":224},{"$f":"HEX2DEC('original hex slots'!D9)","v":46},{"$f":"HEX2DEC('original hex slots'!E9)","v":224},{"$f":"HEX2DEC('original hex slots'!F9)","v":101},{"$f":"HEX2DEC('original hex slots'!G9)","v":144},{"$f":"HEX2DEC('original hex slots'!H9)","v":1},{"$f":"HEX2DEC('original hex slots'!I9)","v":7},{"$f":"HEX2DEC('original hex slots'!J9)","v":90},{"$f":"HEX2DEC('original hex slots'!K9)","v":90},{"$f":"HEX2DEC('original hex slots'!L9)","v":190},{"$f":"HEX2DEC('original hex slots'!M9)","v":1},{"$f":"HEX2DEC('original hex slots'!N9)","v":10},{"$f":"HEX2DEC('original hex slots'!O9)","v":60},{"$f":"HEX2DEC('original hex slots'!P9)","v":60},{"$f":"HEX2DEC('original hex slots'!Q9)","v":120}]
["00000B30",{"$f":"HEX2DEC('original hex slots'!B10)","v":1},{"$f":"HEX2DEC('original hex slots'!C10)","v":4},{"$f":"HEX2DEC('original hex slots'!D10)","v":46},{"$f":"HEX2DEC('original hex slots'!E10)","v":224},{"$f":"HEX2DEC('original hex slots'!F10)","v":46},{"$f":"HEX2DEC('original hex slots'!G10)","v":224},{"$f":"HEX2DEC('original hex slots'!H10)","v":50},{"$f":"HEX2DEC('original hex slots'!I10)","v":200},{"$f":"HEX2DEC('original hex slots'!J10)","v":1},{"$f":"HEX2DEC('original hex slots'!K10)","v":4},{"$f":"HEX2DEC('original hex slots'!L10)","v":46},{"$f":"HEX2DEC('original hex slots'!M10)","v":224},{"$f":"HEX2DEC('original hex slots'!N10)","v":46},{"$f":"HEX2DEC('original hex slots'!O10)","v":224},{"$f":"HEX2DEC('original hex slots'!P10)","v":52},{"$f":"HEX2DEC('original hex slots'!Q10)","v":88}]
["00000B40",{"$f":"HEX2DEC('original hex slots'!B11)","v":1},{"$f":"HEX2DEC('original hex slots'!C11)","v":7},{"$f":"HEX2DEC('original hex slots'!D11)","v":110},{"$f":"HEX2DEC('original hex slots'!E11)","v":110},{"$f":"HEX2DEC('original hex slots'!F11)","v":160},{"$f":"HEX2DEC('original hex slots'!G11)","v":1},{"$f":"HEX2DEC('original hex slots'!H11)","v":5},{"$f":"HEX2DEC('original hex slots'!I11)","v":0},{"$f":"HEX2DEC('original hex slots'!J11)","v":0},{"$f":"HEX2DEC('original hex slots'!K11)","v":25},{"$f":"HEX2DEC('original hex slots'!L11)","v":10},{"$f":"HEX2DEC('original hex slots'!M11)","v":10},{"$f":"HEX2DEC('original hex slots'!N11)","v":39},{"$f":"HEX2DEC('original hex slots'!O11)","v":16},{"$f":"HEX2DEC('original hex slots'!P11)","v":39},{"$f":"HEX2DEC('original hex slots'!Q11)","v":16}]
["00000B50",{"$f":"HEX2DEC('original hex slots'!B12)","v":54},{"$f":"HEX2DEC('original hex slots'!C12)","v":176},{"$f":"HEX2DEC('original hex slots'!D12)","v":1},{"$f":"HEX2DEC('original hex slots'!E12)","v":10},{"$f":"HEX2DEC('original hex slots'!F12)","v":95},{"$f":"HEX2DEC('original hex slots'!G12)","v":95},{"$f":"HEX2DEC('original hex slots'!H12)","v":145},{"$f":"HEX2DEC('original hex slots'!I12)","v":1},{"$f":"HEX2DEC('original hex slots'!J12)","v":10},{"$f":"HEX2DEC('original hex slots'!K12)","v":100},{"$f":"HEX2DEC('original hex slots'!L12)","v":100},{"$f":"HEX2DEC('original hex slots'!M12)","v":110},{"$f":"HEX2DEC('original hex slots'!N12)","v":1},{"$f":"HEX2DEC('original hex slots'!O12)","v":0},{"$f":"HEX2DEC('original hex slots'!P12)","v":0},{"$f":"HEX2DEC('original hex slots'!Q12)","v":0}]
["00000B60",{"$f":"HEX2DEC('original hex slots'!B13)","v":10},{"$f":"HEX2DEC('original hex slots'!C13)","v":1},{"$f":"HEX2DEC('original hex slots'!D13)","v":0},{"$f":"HEX2DEC('original hex slots'!E13)","v":0},{"$f":"HEX2DEC('original hex slots'!F13)","v":0},{"$f":"HEX2DEC('original hex slots'!G13)","v":140},{"$f":"HEX2DEC('original hex slots'!H13)","v":1},{"$f":"HEX2DEC('original hex slots'!I13)","v":7},{"$f":"HEX2DEC('original hex slots'!J13)","v":46},{"$f":"HEX2DEC('original hex slots'!K13)","v":224},{"$f":"HEX2DEC('original hex slots'!L13)","v":50},{"$f":"HEX2DEC('original hex slots'!M13)","v":200},{"$f":"HEX2DEC('original hex slots'!N13)","v":132},{"$f":"HEX2DEC('original hex slots'!O13)","v":208},{"$f":"HEX2DEC('original hex slots'!P13)","v":1},{"$f":"HEX2DEC('original hex slots'!Q13)","v":11}]
["00000B70",{"$f":"HEX2DEC('original hex slots'!B14)","v":0},{"$f":"HEX2DEC('original hex slots'!C14)","v":1},{"$f":"HEX2DEC('original hex slots'!D14)","v":2},{"$f":"HEX2DEC('original hex slots'!E14)","v":3},{"$f":"HEX2DEC('original hex slots'!F14)","v":4},{"$f":"HEX2DEC('original hex slots'!G14)","v":5},{"$f":"HEX2DEC('original hex slots'!H14)","v":6},{"$f":"HEX2DEC('original hex slots'!I14)","v":7},{"$f":"HEX2DEC('original hex slots'!J14)","v":2},{"$f":"HEX2DEC('original hex slots'!K14)","v":4},{"$f":"HEX2DEC('original hex slots'!L14)","v":0},{"$f":"HEX2DEC('original hex slots'!M14)","v":9},{"$f":"HEX2DEC('original hex slots'!N14)","v":1},{"$f":"HEX2DEC('original hex slots'!O14)","v":0},{"$f":"HEX2DEC('original hex slots'!P14)","v":1},{"$f":"HEX2DEC('original hex slots'!Q14)","v":1}]
["00000B80",{"$f":"HEX2DEC('original hex slots'!B15)","v":1},{"$f":"HEX2DEC('original hex slots'!C15)","v":1},{"$f":"HEX2DEC('original hex slots'!D15)","v":1},{"$f":"HEX2DEC('original hex slots'!E15)","v":0},{"$f":"HEX2DEC('original hex slots'!F15)","v":1},{"$f":"HEX2DEC('original hex slots'!G15)","v":128},{"$f":"HEX2DEC('original hex slots'!H15)","v":128},{"$f":"HEX2DEC('original hex slots'!I15)","v":128},{"$f":"HEX2DEC('original hex slots'!J15)","v":128},{"$f":"HEX2DEC('original hex slots'!K15)","v":117},{"$f":"HEX2DEC('original hex slots'!L15)","v":117},{"$f":"HEX2DEC('original hex slots'!M15)","v":117},{"$f":"HEX2DEC('original hex slots'!N15)","v":114},{"$f":"HEX2DEC('original hex slots'!O15)","v":107},{"$f":"HEX2DEC('original hex slots'!P15)","v":106},{"$f":"HEX2DEC('original hex slots'!Q15)","v":104}]
["00000B90",{"$f":"HEX2DEC('original hex slots'!B16)","v":101},{"$f":"HEX2DEC('original hex slots'!C16)","v":97},{"$f":"HEX2DEC('original hex slots'!D16)","v":96},{"$f":"HEX2DEC('original hex slots'!E16)","v":94},{"$f":"HEX2DEC('original hex slots'!F16)","v":97},{"$f":"HEX2DEC('original hex slots'!G16)","v":90},{"$f":"HEX2DEC('original hex slots'!H16)","v":88},{"$f":"HEX2DEC('original hex slots'!I16)","v":84},{"$f":"HEX2DEC('original hex slots'!J16)","v":97},{"$f":"HEX2DEC('original hex slots'!K16)","v":84},{"$f":"HEX2DEC('original hex slots'!L16)","v":81},{"$f":"HEX2DEC('original hex slots'!M16)","v":75},{"$f":"HEX2DEC('original hex slots'!N16)","v":97},{"$f":"HEX2DEC('original hex slots'!O16)","v":79},{"$f":"HEX2DEC('original hex slots'!P16)","v":75},{"$f":"HEX2DEC('original hex slots'!Q16)","v":68}]
["00000BA0",{"$f":"HEX2DEC('original hex slots'!B17)","v":97},{"$f":"HEX2DEC('original hex slots'!C17)","v":75},{"$f":"HEX2DEC('original hex slots'!D17)","v":70},{"$f":"HEX2DEC('original hex slots'!E17)","v":62},{"$f":"HEX2DEC('original hex slots'!F17)","v":97},{"$f":"HEX2DEC('original hex slots'!G17)","v":74},{"$f":"HEX2DEC('original hex slots'!H17)","v":68},{"$f":"HEX2DEC('original hex slots'!I17)","v":62},{"$f":"HEX2DEC('original hex slots'!J17)","v":97},{"$f":"HEX2DEC('original hex slots'!K17)","v":75},{"$f":"HEX2DEC('original hex slots'!L17)","v":68},{"$f":"HEX2DEC('original hex slots'!M17)","v":62},{"$f":"HEX2DEC('original hex slots'!N17)","v":97},{"$f":"HEX2DEC('original hex slots'!O17)","v":77},{"$f":"HEX2DEC('original hex slots'!P17)","v":68},{"$f":"HEX2DEC('original hex slots'!Q17)","v":62}]
["00000BB0",{"$f":"HEX2DEC('original hex slots'!B18)","v":97},{"$f":"HEX2DEC('original hex slots'!C18)","v":77},{"$f":"HEX2DEC('original hex slots'!D18)","v":68},{"$f":"HEX2DEC('original hex slots'!E18)","v":62},{"$f":"HEX2DEC('original hex slots'!F18)","v":97},{"$f":"HEX2DEC('original hex slots'!G18)","v":128},{"$f":"HEX2DEC('original hex slots'!H18)","v":128},{"$f":"HEX2DEC('original hex slots'!I18)","v":128},{"$f":"HEX2DEC('original hex slots'!J18)","v":128},{"$f":"HEX2DEC('original hex slots'!K18)","v":131},{"$f":"HEX2DEC('original hex slots'!L18)","v":131},{"$f":"HEX2DEC('original hex slots'!M18)","v":131},{"$f":"HEX2DEC('original hex slots'!N18)","v":131},{"$f":"HEX2DEC('original hex slots'!O18)","v":133},{"$f":"HEX2DEC('original hex slots'!P18)","v":133},{"$f":"HEX2DEC('original hex slots'!Q18)","v":132}]
["00000BC0",{"$f":"HEX2DEC('original hex slots'!B19)","v":129},{"$f":"HEX2DEC('original hex slots'!C19)","v":136},{"$f":"HEX2DEC('original hex slots'!D19)","v":135},{"$f":"HEX2DEC('original hex slots'!E19)","v":135},{"$f":"HEX2DEC('original hex slots'!F19)","v":127},{"$f":"HEX2DEC('original hex slots'!G19)","v":140},{"$f":"HEX2DEC('original hex slots'!H19)","v":139},{"$f":"HEX2DEC('original hex slots'!I19)","v":137},{"$f":"HEX2DEC('original hex slots'!J19)","v":127},{"$f":"HEX2DEC('original hex slots'!K19)","v":144},{"$f":"HEX2DEC('original hex slots'!L19)","v":143},{"$f":"HEX2DEC('original hex slots'!M19)","v":140},{"$f":"HEX2DEC('original hex slots'!N19)","v":127},{"$f":"HEX2DEC('original hex slots'!O19)","v":151},{"$f":"HEX2DEC('original hex slots'!P19)","v":149},{"$f":"HEX2DEC('original hex slots'!Q19)","v":143}]
["00000BD0",{"$f":"HEX2DEC('original hex slots'!B20)","v":127},{"$f":"HEX2DEC('original hex slots'!C20)","v":158},{"$f":"HEX2DEC('original hex slots'!D20)","v":155},{"$f":"HEX2DEC('original hex slots'!E20)","v":143},{"$f":"HEX2DEC('original hex slots'!F20)","v":127},{"$f":"HEX2DEC('original hex slots'!G20)","v":168},{"$f":"HEX2DEC('original hex slots'!H20)","v":162},{"$f":"HEX2DEC('original hex slots'!I20)","v":143},{"$f":"HEX2DEC('original hex slots'!J20)","v":127},{"$f":"HEX2DEC('original hex slots'!K20)","v":179},{"$f":"HEX2DEC('original hex slots'!L20)","v":162},{"$f":"HEX2DEC('original hex slots'!M20)","v":143},{"$f":"HEX2DEC('original hex slots'!N20)","v":127},{"$f":"HEX2DEC('original hex slots'!O20)","v":186},{"$f":"HEX2DEC('original hex slots'!P20)","v":162},{"$f":"HEX2DEC('original hex slots'!Q20)","v":143}]
["00000BE0",{"$f":"HEX2DEC('original hex slots'!B21)","v":127},{"$f":"HEX2DEC('original hex slots'!C21)","v":186},{"$f":"HEX2DEC('original hex slots'!D21)","v":162},{"$f":"HEX2DEC('original hex slots'!E21)","v":143},{"$f":"HEX2DEC('original hex slots'!F21)","v":127},{"$f":"HEX2DEC('original hex slots'!G21)","v":20},{"$f":"HEX2DEC('original hex slots'!H21)","v":80},{"$f":"HEX2DEC('original hex slots'!I21)","v":110},{"$f":"HEX2DEC('original hex slots'!J21)","v":1},{"$f":"HEX2DEC('original hex slots'!K21)","v":50},{"$f":"HEX2DEC('original hex slots'!L21)","v":1},{"$f":"HEX2DEC('original hex slots'!M21)","v":40},{"$f":"HEX2DEC('original hex slots'!N21)","v":5},{"$f":"HEX2DEC('original hex slots'!O21)","v":150},{"$f":"HEX2DEC('original hex slots'!P21)","v":35},{"$f":"HEX2DEC('original hex slots'!Q21)","v":0}]
["00000BF0",{"$f":"HEX2DEC('original hex slots'!B22)","v":0},{"$f":"HEX2DEC('original hex slots'!C22)","v":0},{"$f":"HEX2DEC('original hex slots'!D22)","v":0},{"$f":"HEX2DEC('original hex slots'!E22)","v":0},{"$f":"HEX2DEC('original hex slots'!F22)","v":0},{"$f":"HEX2DEC('original hex slots'!G22)","v":0},{"$f":"HEX2DEC('original hex slots'!H22)","v":0},{"$f":"HEX2DEC('original hex slots'!I22)","v":0},{"$f":"HEX2DEC('original hex slots'!J22)","v":0},{"$f":"HEX2DEC('original hex slots'!K22)","v":0},{"$f":"HEX2DEC('original hex slots'!L22)","v":0},{"$f":"HEX2DEC('original hex slots'!M22)","v":0},{"$f":"HEX2DEC('original hex slots'!N22)","v":0},{"$f":"HEX2DEC('original hex slots'!O22)","v":0},{"$f":"HEX2DEC('original hex slots'!P22)","v":0},{"$f":"HEX2DEC('original hex slots'!Q22)","v":0}]
[]
{"$rows_left_out":22}